Target
Muscarinic acetylcholine receptor M2
Ligand
BDBM50412177
Substrate
Meas. Tech.
ChEMBL_556678 (CHEMBL958965)
Ki
4.17±n/a nM
Citation
 Dei, SBellucci, CBuccioni, MFerraroni, MGuandalini, LManetti, DMarucci, GMatucci, RNesi, MRomanelli, MNScapecchi, STeodori, E Muscarinic antagonists with multiple stereocenters: Synthesis, affinity profile and functional activity of isomeric 1-methyl-2-(2,2-alkylaryl-1,3-oxathiolan-5-yl)pyrrolidine sulfoxide derivatives. Bioorg Med Chem 16:5490-500 (2008)  
Target
Name:
Muscarinic acetylcholine receptor M2
Synonyms:
ACM2_HUMAN Cholinergic, muscarinic M2 Muscarinic acetylcholine receptor M2 and M5 | RecName: Full=Muscarinic acetylcholine receptor M2
Type:
GPCR
Mol. Mass.:
51730.61
Organism:
Homo sapiens (Human)
Description:
P08172
Residue:
466
  
Inhibitor
Name:
BDBM50412177
Synonyms:
CHEMBL493979
Type:
Small organic molecule
Emp. Form.:
C20H29NO2S
Mol. Mass.:
347.515
SMILES:
CN1CCC[C@@H]1[C@@H]1CS(=O)[C@@](O1)(C1CCCCC1)c1ccccc1
: