Target
Substance-K receptor
Ligand
BDBM50412318
Substrate
Meas. Tech.
ChEMBL_514364 (CHEMBL967978)
Ki
0.316±n/a nM
Citation
 Porcelloni, MD'Andrea, PAltamura, MCatalioto, RMGiuliani, SMeini, SFattori, D Cinnamic acids and mono-substituted benzoic acids as useful capping groups for the preparation of hNK2 receptor antagonists. Bioorg Med Chem Lett 18:4705-7 (2008)  
Target
Name:
Substance-K receptor
Synonyms:
NK-2 receptor NK2R NKNAR Neurokinin A receptor Neurokinin-2 (NK-2) SKR TACR2 Tachykinin receptor 2 (NK2) | hnk-3
Type:
Protein
Mol. Mass.:
44455.78
Organism:
Homo sapiens (Human)
Description:
P21452
Residue:
398
  
Inhibitor
Name:
BDBM50412318
Synonyms:
CHEMBL447439 | MEN-15702
Type:
Small organic molecule
Emp. Form.:
C41H52N4O4
Mol. Mass.:
664.876
SMILES:
Cc1ccc(cc1)-c1ccc(cc1)C(=O)NC1(CCCC1)C(=O)N[C@H](Cc1ccccc1)C(=O)NCC1CCN(CC2CCOCC2)CC1
: