Target
Muscarinic acetylcholine receptor M1
Ligand
BDBM50006584
Substrate
Meas. Tech.
ChEMBL_491216 (CHEMBL992812)
Ki
1949.84±n/a nM
Citation
 Scapecchi, SNesi, MMatucci, RBellucci, CBuccioni, MDei, SGuandalini, LManetti, DMartini, EMarucci, GRomanelli, MNTeodori, ECirilli, R Synthesis and pharmacological characterization of chiral pyrrolidinylfuran derivatives: the discovery of new functionally selective muscarinic agonists. J Med Chem 51:3905-12 (2008)  
Target
Name:
Muscarinic acetylcholine receptor M1
Synonyms:
ACM1_HUMAN Cholinergic receptor, muscarinic 1 | Cholinergic, muscarinic M1
Type:
Protein
Mol. Mass.:
51442.54
Organism:
Homo sapiens (Human)
Description:
P11229
Residue:
460
  
Inhibitor
Name:
BDBM50006584
Synonyms:
(McN-A-343) [4-(3-Chloro-phenylcarbamoyloxy)-but-2-ynyl]-trimethyl-ammonium; chloride 4-(3-chlorophenylcarbamoyloxy)-N,N,N-trimethylbut-2-yn-1-aminium CHEMBL40554 McN-A-343 [4-(3-Chloro-phenylcarbamoyloxy)-but-2-ynyl]-trimethyl-ammonium; chloride (McN-A-343)
Type:
Small organic molecule
Emp. Form.:
C14H18ClN2O2
Mol. Mass.:
281.757
SMILES:
C[N+](C)(C)CC#CCOC(=O)Nc1cccc(Cl)c1
: