Target
5-hydroxytryptamine receptor 1B
Ligand
BDBM50412443
Substrate
Meas. Tech.
ChEMBL_537447 (CHEMBL990612)
Ki
200±n/a nM
Citation
 Serafinowska, HTBlaney, FELovell, PJMerlo, GGScott, CMSmith, PWStarr, KRWatson, JM Novel 5-HT(1A/1B/1D) receptors antagonists with potent 5-HT reuptake inhibitory activity. Bioorg Med Chem Lett 18:5581-5 (2008)  
Target
Name:
5-hydroxytryptamine receptor 1B
Synonyms:
5-HT-1B 5-HT1B 5HT1B_HUMAN HTR1DB Serotonin (5-HT) receptor Serotonin Receptor 1B
Type:
G Protein-Coupled Receptor (GPCR)
Mol. Mass.:
43579.17
Organism:
Homo sapiens (Human)
Description:
Receptor binding assays were performed using human clone stably expressed in CHO cells
Residue:
390
  
Inhibitor
Name:
BDBM50412443
Synonyms:
CHEMBL484386
Type:
Small organic molecule
Emp. Form.:
C27H31N3O3
Mol. Mass.:
445.5533
SMILES:
CC(CN1CCC(Cc2ccc3OCC(=O)Nc3c2)CC1)Oc1cccc2nc(C)ccc12
: