Target
5-hydroxytryptamine receptor 1A
Ligand
BDBM50412444
Substrate
Meas. Tech.
ChEMBL_537446 (CHEMBL990611)
Ki
316.23±n/a nM
Citation
 Serafinowska, HTBlaney, FELovell, PJMerlo, GGScott, CMSmith, PWStarr, KRWatson, JM Novel 5-HT(1A/1B/1D) receptors antagonists with potent 5-HT reuptake inhibitory activity. Bioorg Med Chem Lett 18:5581-5 (2008)  
Target
Name:
5-hydroxytryptamine receptor 1A
Synonyms:
5-HT-1A 5-hydroxytryptamine receptor 1A (5-HT-1A) ADRB2RL1 Dopamine D2 receptor and serotonin 1a receptor HTR1A | Serotonin receptor 1A
Type:
Mol. Mass.:
46122.49
Organism:
Homo sapiens (Human)
Description:
Residue:
422
  
Inhibitor
Name:
BDBM50412444
Synonyms:
CHEMBL485427
Type:
Small organic molecule
Emp. Form.:
C25H27N3O3
Mol. Mass.:
417.5002
SMILES:
Cc1ccc2c(OC3CCN(CCc4ccc5OCC(=O)Nc5c4)CC3)cccc2n1
: