Target
5-hydroxytryptamine receptor 1B
Ligand
BDBM50412445
Substrate
Meas. Tech.
ChEMBL_537447 (CHEMBL990612)
Ki
630.96±n/a nM
Citation
 Serafinowska, HTBlaney, FELovell, PJMerlo, GGScott, CMSmith, PWStarr, KRWatson, JM Novel 5-HT(1A/1B/1D) receptors antagonists with potent 5-HT reuptake inhibitory activity. Bioorg Med Chem Lett 18:5581-5 (2008)  
Target
Name:
5-hydroxytryptamine receptor 1B
Synonyms:
5-HT-1B 5-HT1B 5HT1B_HUMAN HTR1DB Serotonin (5-HT) receptor Serotonin Receptor 1B
Type:
G Protein-Coupled Receptor (GPCR)
Mol. Mass.:
43579.17
Organism:
Homo sapiens (Human)
Description:
Receptor binding assays were performed using human clone stably expressed in CHO cells
Residue:
390
  
Inhibitor
Name:
BDBM50412445
Synonyms:
CHEMBL485630
Type:
Small organic molecule
Emp. Form.:
C26H27N3O4
Mol. Mass.:
445.5103
SMILES:
Cc1ccc2c(OCC3CCN(CC(=O)c4ccc5OCC(=O)Nc5c4)CC3)cccc2n1
: