Target
Histamine H3 receptor
Ligand
BDBM50401007
Substrate
Meas. Tech.
ChEMBL_536770 (CHEMBL984564)
Ki
6.61±n/a nM
Citation
 Morini, GComini, MRivara, MRivara, SBordi, FPlazzi, PVFlammini, LSaccani, FBertoni, SBallabeni, VBarocelli, EMor, M Synthesis and structure-activity relationships for biphenyl H3 receptor antagonists with moderate anti-cholinesterase activity. Bioorg Med Chem 16:9911-24 (2008)  
Target
Name:
Histamine H3 receptor
Synonyms:
HH3R Hrh3
Type:
G Protein-Coupled Receptor (GPCR)
Mol. Mass.:
48607.98
Organism:
Rattus norvegicus (rat)
Description:
Residue:
445
  
Inhibitor
Name:
BDBM50401007
Synonyms:
CHEMBL209478
Type:
Small organic molecule
Emp. Form.:
C18H24N2
Mol. Mass.:
268.3966
SMILES:
CN(C)Cc1ccc(cc1)-c1ccc(CN(C)C)cc1
: