Target
Neuronal acetylcholine receptor subunit alpha-4
Ligand
BDBM50411209
Substrate
Meas. Tech.
ChEMBL_558727 (CHEMBL954129)
EC50
173.78±n/a nM
Citation
 Ye, MDawson, MI 3D-QSAR and QSSR studies of 3,8-diazabicyclo[4.2.0]octane derivatives as neuronal nicotinic acetylcholine receptors by comparative molecular field analysis (CoMFA). Bioorg Med Chem Lett 19:127-31 (2008)  
Target
Name:
Neuronal acetylcholine receptor subunit alpha-4
Synonyms:
ACHA4_HUMAN CHRNA4 protein Neuronal acetylcholine receptor protein alpha-4 subunit Nicotinic acetylcholine receptor alpha4/beta2/alpha5
Type:
Mol. Mass.:
69963.49
Organism:
Homo sapiens (Human)
Description:
NACHRA4
Residue:
627
  
Inhibitor
Name:
BDBM50411209
Synonyms:
CHEMBL448697
Type:
Small organic molecule
Emp. Form.:
C12H13BrN4
Mol. Mass.:
293.162
SMILES:
Brc1ncc(cc1C#N)N1C[C@H]2CCNC[C@@H]12
: