Target
Neuronal acetylcholine receptor subunit alpha-3
Ligand
BDBM50411227
Substrate
Meas. Tech.
ChEMBL_558728 (CHEMBL954130)
EC50
4466.84±n/a nM
Citation
 Ye, MDawson, MI 3D-QSAR and QSSR studies of 3,8-diazabicyclo[4.2.0]octane derivatives as neuronal nicotinic acetylcholine receptors by comparative molecular field analysis (CoMFA). Bioorg Med Chem Lett 19:127-31 (2008)  
Target
Name:
Neuronal acetylcholine receptor subunit alpha-3
Synonyms:
ACHA3_HUMAN Cholinergic, Nicotinic Alpha3Beta2 Cholinergic, Nicotinic Alpha3Beta4x NACHRA3 Neuronal acetylcholine receptor subunit alpha-3 nicotinic central
Type:
Enzyme Catalytic Domain
Mol. Mass.:
57479.03
Organism:
Homo sapiens (Human)
Description:
Cholinergic, Nicotinic Alpha3Beta2 0 HUMAN::P32297
Residue:
505
  
Inhibitor
Name:
BDBM50411227
Synonyms:
CHEMBL480211
Type:
Small organic molecule
Emp. Form.:
C12H17N3O
Mol. Mass.:
219.2829
SMILES:
COc1cncc(c1)N1CC[C@@H]2CN[C@@H]2C1
: