Target
Liver carboxylesterase 1
Ligand
BDBM22759
Substrate
Meas. Tech.
ChEMBL_560257 (CHEMBL1019596)
Ki
7.94±n/a nM
Citation
 Harada, TNakagawa, YWadkins, RMPotter, PMWheelock, CE Comparison of benzil and trifluoromethyl ketone (TFK)-mediated carboxylesterase inhibition using classical and 3D-quantitative structure-activity relationship analysis. Bioorg Med Chem 17:149-64 (2008)  
Target
Name:
Liver carboxylesterase 1
Synonyms:
Acyl coenzyme A:cholesterol acyltransferase CES1 EST1_HUMAN Serine hydrolase (CES1)
Type:
Protein
Mol. Mass.:
62520.83
Organism:
Homo sapiens (Human)
Description:
Residue:
567
  
Inhibitor
Name:
BDBM22759
Synonyms:
1-[4-(2-oxo-2-phenylacetyl)phenyl]-2-phenylethane-1,2-dione JMC505727 Compound 18
Type:
Small organic molecule
Emp. Form.:
C22H14O4
Mol. Mass.:
342.3442
SMILES:
O=C(C(=O)c1ccc(cc1)C(=O)C(=O)c1ccccc1)c1ccccc1
: