Target
Liver carboxylesterase 1
Ligand
BDBM50371969
Substrate
Meas. Tech.
ChEMBL_560263 (CHEMBL1019602)
Ki
3.98±n/a nM
Citation
 Harada, TNakagawa, YWadkins, RMPotter, PMWheelock, CE Comparison of benzil and trifluoromethyl ketone (TFK)-mediated carboxylesterase inhibition using classical and 3D-quantitative structure-activity relationship analysis. Bioorg Med Chem 17:149-64 (2008)  
Target
Name:
Liver carboxylesterase 1
Synonyms:
Acyl coenzyme A:cholesterol acyltransferase CES1 EST1_HUMAN Serine hydrolase (CES1)
Type:
Protein
Mol. Mass.:
62520.83
Organism:
Homo sapiens (Human)
Description:
Residue:
567
  
Inhibitor
Name:
BDBM50371969
Synonyms:
CHEMBL270374
Type:
Small organic molecule
Emp. Form.:
C13H23F3OS
Mol. Mass.:
284.381
SMILES:
CCCCCCCCCCSCC(=O)C(F)(F)F
: