Target
Alpha-1A adrenergic receptor
Ligand
BDBM69602
Substrate
Meas. Tech.
ChEMBL_539780 (CHEMBL1034998)
Ki
0.427±n/a nM
Citation
 Quaglia, WPiergentili, ADel Bello, FFarande, YGiannella, MPigini, MRafaiani, GCarrieri, AAmantini, CLucciarini, RSantoni, GPoggesi, ELeonardi, A Structure-activity relationships in 1,4-benzodioxan-related compounds. 9. From 1,4-benzodioxane to 1,4-dioxane ring as a promising template of novel alpha1D-adrenoreceptor antagonists, 5-HT1A full agonists, and cytotoxic agents. J Med Chem 51:6359-70 (2008)  
Target
Name:
Alpha-1A adrenergic receptor
Synonyms:
ADA1A_HUMAN ADRA1C Alpha 1A-adrenoceptor Alpha adrenergic receptor 1a Alpha-adrenergic receptor 1c adrenergic Alpha1 | adrenergic Alpha1C
Type:
Cell-surface receptors
Mol. Mass.:
51511.67
Organism:
Homo sapiens (Human)
Description:
P35348
Residue:
466
  
Inhibitor
Name:
BDBM69602
Synonyms:
2,3-dihydro-1,4-benzodioxin-3-ylmethyl-[2-(2,6-dimethoxyphenoxy)ethyl]amine;hydrochloride MLS000859914 SMR000326775 WB-4101 hydrochloride | cid_11957505
Type:
Small organic molecule
Emp. Form.:
C19H23NO5
Mol. Mass.:
345.3896
SMILES:
COc1cccc(OC)c1OCCNCC1COc2ccccc2O1
: