Target
5-hydroxytryptamine receptor 1A
Ligand
BDBM50412786
Substrate
Meas. Tech.
ChEMBL_539783 (CHEMBL1035001)
Ki
7.59±n/a nM
Citation
 Quaglia, WPiergentili, ADel Bello, FFarande, YGiannella, MPigini, MRafaiani, GCarrieri, AAmantini, CLucciarini, RSantoni, GPoggesi, ELeonardi, A Structure-activity relationships in 1,4-benzodioxan-related compounds. 9. From 1,4-benzodioxane to 1,4-dioxane ring as a promising template of novel alpha1D-adrenoreceptor antagonists, 5-HT1A full agonists, and cytotoxic agents. J Med Chem 51:6359-70 (2008)  
Target
Name:
5-hydroxytryptamine receptor 1A
Synonyms:
5-HT-1A 5-hydroxytryptamine receptor 1A (5-HT-1A) ADRB2RL1 Dopamine D2 receptor and serotonin 1a receptor HTR1A | Serotonin receptor 1A
Type:
Mol. Mass.:
46122.49
Organism:
Homo sapiens (Human)
Description:
Residue:
422
  
Inhibitor
Name:
BDBM50412786
Synonyms:
CHEMBL493283
Type:
Small organic molecule
Emp. Form.:
C26H29NO4
Mol. Mass.:
419.5128
SMILES:
COc1ccccc1OCCNC[C@@H]1COC(CO1)(c1ccccc1)c1ccccc1
: