Target
Neuromedin-K receptor
Ligand
BDBM50412942
Substrate
Meas. Tech.
ChEMBL_515484 (CHEMBL992211)
Ki
1.58±n/a nM
Citation
 Smith, PWWyman, PALovell, PGoodacre, CSerafinowska, HTVong, AHarrington, FFlynn, SBradley, DMPorter, RCoggon, SMurkitt, GSearle, KThomas, DRWatson, JMMartin, WWu, ZDawson, LA New quinoline NK3 receptor antagonists with CNS activity. Bioorg Med Chem Lett 19:837-40 (2009)  
Target
Name:
Neuromedin-K receptor
Synonyms:
NK-3 receptor NK3R NKR Neurokinin B receptor Neuromedin-3 receptor (NK-3R) Neuromedin-K receptor Neuromedin-K receptor (NK3) TAC3R Tachykinin receptor 3 | Tachykinin receptor 3 (NK3)
Type:
Enzyme
Mol. Mass.:
52221.96
Organism:
Homo sapiens (Human)
Description:
P29371
Residue:
465
  
Inhibitor
Name:
BDBM50412942
Synonyms:
CHEMBL480249
Type:
Small organic molecule
Emp. Form.:
C29H29N3O3S
Mol. Mass.:
499.624
SMILES:
CN(Cc1c(nc2ccccc2c1C(=O)N[C@@H](C1CC1)c1ccccc1)-c1ccccc1)S(C)(=O)=O
: