Target
C5a anaphylatoxin chemotactic receptor 1
Ligand
BDBM50413240
Substrate
Meas. Tech.
ChEMBL_541069 (CHEMBL1024769)
EC50
123.03±n/a nM
Citation
 Sanganee, HJBaxter, ABarber, SBrown, AJGrice, DHunt, FKing, SLaughton, DPairaudeau, GThong, BWeaver, RUnitt, J Discovery of small molecule human C5a receptor antagonists. Bioorg Med Chem Lett 19:1143-7 (2009)  
Target
Name:
C5a anaphylatoxin chemotactic receptor 1
Synonyms:
C5AR C5AR1_HUMAN C5a anaphylatoxin chemotactic receptor C5a-R | CD_antigen=CD88
Type:
Enzyme
Mol. Mass.:
39347.68
Organism:
Homo sapiens (Human)
Description:
P21730
Residue:
350
  
Inhibitor
Name:
BDBM50413240
Synonyms:
CHEMBL471412
Type:
Small organic molecule
Emp. Form.:
C28H29FN2O4
Mol. Mass.:
476.5393
SMILES:
COc1ccc(N(C(C(=O)NC2CCCC2)c2ccccc2F)C(=O)c2ccccc2)c(OC)c1
: