Target
Muscarinic acetylcholine receptor M3
Ligand
BDBM50413465
Substrate
Meas. Tech.
ChEMBL_562388 (CHEMBL1018821)
Kd
3.16±n/a nM
Citation
 Budzik, BWang, YShi, DWang, FXie, HWan, ZZhu, CFoley, JJNuthulaganti, PKallal, LASarau, HMMorrow, DMMoore, MLRivero, RAPalovich, MSalmon, MBelmonte, KELaine, DIJin, J M3 muscarinic acetylcholine receptor antagonists: SAR and optimization of bi-aryl amines. Bioorg Med Chem Lett 19:1686-90 (2009)  
Target
Name:
Muscarinic acetylcholine receptor M3
Synonyms:
ACM3_HUMAN Cholinergic, muscarinic M3 Muscarinic receptor M3 | RecName: Full=Muscarinic acetylcholine receptor M3
Type:
Enzyme
Mol. Mass.:
66151.03
Organism:
Homo sapiens (Human)
Description:
P20309
Residue:
590
  
Inhibitor
Name:
BDBM50413465
Synonyms:
CHEMBL558605
Type:
Small organic molecule
Emp. Form.:
C32H41FN5O
Mol. Mass.:
530.6987
SMILES:
C[C@H]1CN(Cc2cccc(c2)-c2cc(CNC(=O)c3cccc(C[N+]4(C)CCNCC4)c3)ccc2F)CCN1
: