Target
Beta-2 adrenergic receptor
Ligand
BDBM25771
Substrate
Meas. Tech.
ChEMBL_562921 (CHEMBL1019681)
EC50
0.251189±n/a nM
Citation
 Procopiou, PABarrett, VJBevan, NJBiggadike, KButchers, PRCoe, DMConroy, REdney, DDField, RNFord, AJGuntrip, SBLooker, BEMcLay, IMMonteith, MJMorrison, VSMutch, PJRichards, SASasse, RSmith, CE Synthesis and structure-activity relationships of long-acting beta2 adrenergic receptor agonists incorporating arylsulfonamide groups. J Med Chem 52:2280-8 (2009)  
Target
Name:
Beta-2 adrenergic receptor
Synonyms:
ADRB2 ADRB2_HUMAN Beta-2 adrenoceptor | Beta-2 adrenoreceptor
Type:
Mol. Mass.:
46461.69
Organism:
Homo sapiens (Human)
Description:
P07550
Residue:
413
  
Inhibitor
Name:
BDBM25771
Synonyms:
1-hydroxy-2-naphthoic acid;4-[1-hydroxy-2-[6-(4-phenylbutoxy)hexylamino]ethyl]-2-methylol-phenol Aeromax Serevent | salmeterol xinafoate
Type:
Small organic molecule
Emp. Form.:
C25H37NO4
Mol. Mass.:
415.5656
SMILES:
OCc1cc(ccc1O)C(O)CNCCCCCCOCCCCc1ccccc1
: