Target
Histamine H2 receptor
Ligand
BDBM50413497
Substrate
Meas. Tech.
ChEMBL_562964 (CHEMBL1015363)
EC50
813±n/a nM
Citation
 Igel, PSchneider, ESchnell, DElz, SSeifert, RBuschauer, A N(G)-acylated imidazolylpropylguanidines as potent histamine H4 receptor agonists: selectivity by variation of the N(G)-substituent. J Med Chem 52:2623-7 (2009)  
Target
Name:
Histamine H2 receptor
Synonyms:
Gastric receptor I HISTAMINE H2 HRH2_CAVPO | Histamine H2-Gs alpha S
Type:
G Protein-Coupled Receptor (GPCR)
Mol. Mass.:
40567.22
Organism:
Cavia porcellus (domestic guinea pig)
Description:
For the H2 receptor-binding assays, guinea pig striatum was used.
Residue:
359
  
Inhibitor
Name:
BDBM50413497
Synonyms:
CHEMBL443896 | UR-PI288
Type:
Small organic molecule
Emp. Form.:
C9H15N5O
Mol. Mass.:
209.2483
SMILES:
CC(=O)NC(N)=NCCCc1cnc[nH]1
: