Target
Histamine H2 receptor
Ligand
BDBM50377986
Substrate
Meas. Tech.
ChEMBL_562964 (CHEMBL1015363)
EC50
16±n/a nM
Citation
 Igel, PSchneider, ESchnell, DElz, SSeifert, RBuschauer, A N(G)-acylated imidazolylpropylguanidines as potent histamine H4 receptor agonists: selectivity by variation of the N(G)-substituent. J Med Chem 52:2623-7 (2009)  
Target
Name:
Histamine H2 receptor
Synonyms:
Gastric receptor I HISTAMINE H2 HRH2_CAVPO | Histamine H2-Gs alpha S
Type:
G Protein-Coupled Receptor (GPCR)
Mol. Mass.:
40567.22
Organism:
Cavia porcellus (domestic guinea pig)
Description:
For the H2 receptor-binding assays, guinea pig striatum was used.
Residue:
359
  
Inhibitor
Name:
BDBM50377986
Synonyms:
CHEMBL483406 | UR-AK24
Type:
Small organic molecule
Emp. Form.:
C17H23N5O
Mol. Mass.:
313.3974
SMILES:
CC(CC(=O)NC(N)=NCCCc1cnc[nH]1)c1ccccc1
: