Target
Equilibrative nucleoside transporter 1
Ligand
BDBM50366949
Substrate
Meas. Tech.
ChEMBL_540485 (CHEMBL1030589)
Ki
9.12±n/a nM
Citation
 Gupte, ABuolamwini, JK CoMFA and CoMSIA 3D-QSAR studies on S(6)-(4-nitrobenzyl)mercaptopurine riboside (NBMPR) analogs as inhibitors of human equilibrative nucleoside transporter 1 (hENT1). Bioorg Med Chem Lett 19:314-8 (2008)  
Target
Name:
Equilibrative nucleoside transporter 1
Synonyms:
ENT1 Equilibrative Nucleoside Transporter 1 (ENT1) Equilibrative nucleoside transporter 1 S29A1_HUMAN Solute carrier family 29 member 1
Type:
Multi-pass membrane protein
Mol. Mass.:
50225.92
Organism:
Homo sapiens (Human)
Description:
Residue:
456
  
Inhibitor
Name:
BDBM50366949
Synonyms:
BDBM50413728 CHEMBL611841
Type:
Small organic molecule
Emp. Form.:
C17H17FN4O4S
Mol. Mass.:
392.405
SMILES:
OC[C@H]1O[C@H]([C@H](O)[C@@H]1O)n1cnc2c(SCc3ccc(F)cc3)ncnc12
: