Target
Equilibrative nucleoside transporter 1
Ligand
BDBM50412070
Substrate
Meas. Tech.
ChEMBL_540485 (CHEMBL1030589)
Ki
16.22±n/a nM
Citation
 Gupte, ABuolamwini, JK CoMFA and CoMSIA 3D-QSAR studies on S(6)-(4-nitrobenzyl)mercaptopurine riboside (NBMPR) analogs as inhibitors of human equilibrative nucleoside transporter 1 (hENT1). Bioorg Med Chem Lett 19:314-8 (2008)  
Target
Name:
Equilibrative nucleoside transporter 1
Synonyms:
ENT1 Equilibrative Nucleoside Transporter 1 (ENT1) Equilibrative nucleoside transporter 1 S29A1_HUMAN Solute carrier family 29 member 1
Type:
Multi-pass membrane protein
Mol. Mass.:
50225.92
Organism:
Homo sapiens (Human)
Description:
Residue:
456
  
Inhibitor
Name:
BDBM50412070
Synonyms:
CHEMBL59168
Type:
Small organic molecule
Emp. Form.:
C18H20N4O4S
Mol. Mass.:
388.441
SMILES:
Cc1cccc(CSc2ncnc3n(cnc23)[C@@H]2O[C@H](CO)[C@@H](O)[C@H]2O)c1
: