Target
Potassium voltage-gated channel subfamily H member 2
Ligand
BDBM50117924
Substrate
Meas. Tech.
ChEMBL_572012 (CHEMBL1023674)
IC50
77624.71±n/a nM
Citation
 Ermondi, GVisentin, SCaron, G GRIND-based 3D-QSAR and CoMFA to investigate topics dominated by hydrophobic interactions: the case of hERG K+ channel blockers. Eur J Med Chem 44:1926-32 (2009)  
Target
Name:
Potassium voltage-gated channel subfamily H member 2
Synonyms:
1,3-beta-glucan synthase component GLS2 ERG Eag-related protein 1 Ether-a-go-go-related gene (HERG) Ether-a-go-go-related gene potassium channel 1 Ether-a-go-go-related gene potassium channel 1 (hERG1) Ether-a-go-go-related protein 1 H-ERG KCNH2 Potassium voltage-gated channel subfamily H member 2 (hERG) Voltage-gated potassium channel subunit Kv11.1 hERG Potassium Channel 1 | putative potassium channel subunit
Type:
Multi-pass membrane protein
Mol. Mass.:
126672.65
Organism:
Homo sapiens (Human)
Description:
Q12809
Residue:
1159
  
Inhibitor
Name:
BDBM50117924
Synonyms:
1-Cyclopropyl-6-fluoro-5-methyl-7-(3-methyl-piperazin-1-yl)-4-oxo-1,4,4a,8a-tetrahydro-quinoline-3-carboxylic acid (Grepafloxacin) 1-cyclopropyl-6-fluoro-5-methyl-7-(3-methylpiperazin-1-yl)-4-oxo-1,4-dihydroquinoline-3-carboxylic acid GREPAFLOXACIN | Raxar
Type:
Small organic molecule
Emp. Form.:
C19H22FN3O3
Mol. Mass.:
359.3947
SMILES:
CC1CN(CCN1)c1cc2n(cc(C(O)=O)c(=O)c2c(C)c1F)C1CC1
: