Target
Cytochrome P450 2A5
Ligand
BDBM50159245
Substrate
Meas. Tech.
ChEMBL_572014 (CHEMBL1023676)
IC50
2198±n/a nM
Citation
 Roy, KRoy, PP Exploring QSAR and QAAR for inhibitors of cytochrome P450 2A6 and 2A5 enzymes using GFA and G/PLS techniques. Eur J Med Chem 44:1941-51 (2009)  
Target
Name:
Cytochrome P450 2A5
Synonyms:
CP2A5_MOUSE Cyp2a5
Type:
PROTEIN
Mol. Mass.:
56752.73
Organism:
Mus musculus
Description:
ChEMBL_572014
Residue:
494
  
Inhibitor
Name:
BDBM50159245
Synonyms:
1,4-dibromobenzene p-bromophenyl bromide | p-dibromobenzene
Type:
Small organic molecule
Emp. Form.:
C6H4Br2
Mol. Mass.:
235.904
SMILES:
Brc1ccc(Br)cc1
: