Target
Tyrosine-protein phosphatase non-receptor type 1
Ligand
BDBM50131547
Substrate
Meas. Tech.
ChEMBL_570758 (CHEMBL1026933)
Ki
40±n/a nM
Citation
 Brown, SPMuchmore, SW Large-scale application of high-throughput molecular mechanics with Poisson-Boltzmann surface area for routine physics-based scoring of protein-ligand complexes. J Med Chem 52:3159-65 (2009)  
Target
Name:
Tyrosine-protein phosphatase non-receptor type 1
Synonyms:
PTN1_HUMAN PTPN1 Protein tyrosine phosphatase-1B (PTP1B) Protein-tyrosine phosphatase 1B (PTP1B) Tyrosine-protein phosphatase non-receptor type 1 (PTP1B)
Type:
Protein phosphatase
Mol. Mass.:
49963.76
Organism:
Homo sapiens (Human)
Description:
Human recombinant GST-fusion PTP1B (1-435).
Residue:
435
  
Inhibitor
Name:
BDBM50131547
Synonyms:
2-(N-(4-(2-acetamido-3-(4-(5-chloro-3-hydroxy-2-(methoxycarbonyl)phenoxy)butylamino)-3-oxopropyl)-2-ethylphenyl)-1-carboxyformamido)benzoic acid CHEMBL117496
Type:
Small organic molecule
Emp. Form.:
C34H36ClN3O11
Mol. Mass.:
698.116
SMILES:
CCc1cc(CC(NC(C)=O)C(=O)NCCCCOc2cc(Cl)cc(O)c2C(=O)OC)ccc1N(C(=O)C(O)=O)c1ccccc1C(O)=O
: