Target
Histamine H4 receptor
Ligand
BDBM50414378
Substrate
Meas. Tech.
ChEMBL_576569 (CHEMBL1034550)
Ki
100±n/a nM
Citation
 Lim, HDIstyastono, EPvan de Stolpe, ARomeo, GGobbi, SSchepers, MLahaye, RMenge, WMZuiderveld, OPJongejan, ASmits, RABakker, RAHaaksma, EELeurs, Rde Esch, IJ Clobenpropit analogs as dual activity ligands for the histamine H3 and H4 receptors: synthesis, pharmacological evaluation, and cross-target QSAR studies. Bioorg Med Chem 17:3987-94 (2009)  
Target
Name:
Histamine H4 receptor
Synonyms:
AXOR35 GPCR105 HH4R HRH4 Histamine H4 receptor Histamine receptor (H3 and H4) SP9144
Type:
G Protein-Coupled Receptor (GPCR)
Mol. Mass.:
44517.02
Organism:
Homo sapiens (Human)
Description:
Binding assays were using CHO cells stably expressing hH4R receptors.
Residue:
390
  
Inhibitor
Name:
BDBM50414378
Synonyms:
CHEMBL1202320
Type:
Small organic molecule
Emp. Form.:
C16H22N4S
Mol. Mass.:
302.438
SMILES:
Cc1ccc(CCN=C(N)SCCCc2cnc[nH]2)cc1
: