Target
5-hydroxytryptamine receptor 4
Ligand
BDBM82087
Substrate
Meas. Tech.
ChEMBL_577765 (CHEMBL1053072)
Ki
245.47±n/a nM
Citation
 Hanna-Elias, AManallack, DTBerque-Bestel, IIrving, HRCoupar, IMIskander, MN Synthesis and preliminary screening of novel indole-3-methanamines as 5-HT4 receptor ligands. Eur J Med Chem 44:2952-9 (2009)  
Target
Name:
5-hydroxytryptamine receptor 4
Synonyms:
5-HT-4 5-HT4S 5-HT4b 5-HT4d 5-hydroxytryptamine receptor 4 5HT4R_HUMAN Serotonin (5-HT) receptor Serotonin 4 (5-HT4) receptor | Serotonin Receptor 4
Type:
Enzyme
Mol. Mass.:
43767.54
Organism:
Homo sapiens (Human)
Description:
Q13639
Residue:
388
  
Inhibitor
Name:
BDBM82087
Synonyms:
2-(5-methoxy-1H-indol-3-yl)ethanamine 5-Methoxytryptamine hydrochloride tryptamine, 5-Methoxy
Type:
Small organic molecule
Emp. Form.:
C11H14N2O
Mol. Mass.:
190.2417
SMILES:
COc1ccc2[nH]cc(CCN)c2c1
: