Target
Ecdysone receptor
Ligand
BDBM50414651
Substrate
Meas. Tech.
ChEMBL_582869 (CHEMBL1051107)
IC50
2570.4±n/a nM
Citation
 Harada, TNakagawa, YAkamatsu, MMiyagawa, H Evaluation of hydrogen bonds of ecdysteroids in the ligand-receptor interactions using a protein modeling system. Bioorg Med Chem 17:5868-73 (2009)  
Target
Name:
Ecdysone receptor
Synonyms:
20-hydroxy-ecdysone receptor ECR_DROME EcRH NR1H1 | Nuclear receptor subfamily 1 group H member 1
Type:
PROTEIN
Mol. Mass.:
93857.12
Organism:
Drosophila melanogaster
Description:
ChEMBL_582869
Residue:
878
  
Inhibitor
Name:
BDBM50414651
Synonyms:
ECDYSONE
Type:
Small organic molecule
Emp. Form.:
C27H44O6
Mol. Mass.:
464.6347
SMILES:
C[C@H]([C@@H](O)CCC(C)(C)O)[C@@H]1CC[C@]2(O)C3=CC(=O)[C@@H]4C[C@H](O)[C@@H](O)C[C@@]4(C)[C@@H]3CC[C@@]12C
: