Target
5-hydroxytryptamine receptor 4
Ligand
BDBM50414661
Substrate
Meas. Tech.
ChEMBL_583012 (CHEMBL1051850)
EC50
1.26±n/a nM
Citation
 McKinnell, RMArmstrong, SRBeattie, DTChoi, SKFatheree, PRGendron, RAGoldblum, AHumphrey, PPLong, DDMarquess, DGShaw, JPSmith, JATurner, SDVickery, RG A multivalent approach to the design and discovery of orally efficacious 5-HT4 receptor agonists. J Med Chem 52:5330-43 (2009)  
Target
Name:
5-hydroxytryptamine receptor 4
Synonyms:
5-HT-4 5-HT4S 5-HT4b 5-HT4d 5-hydroxytryptamine receptor 4 5HT4R_HUMAN Serotonin (5-HT) receptor Serotonin 4 (5-HT4) receptor | Serotonin Receptor 4
Type:
Enzyme
Mol. Mass.:
43767.54
Organism:
Homo sapiens (Human)
Description:
Q13639
Residue:
388
  
Inhibitor
Name:
BDBM50414661
Synonyms:
CHEMBL541968
Type:
Small organic molecule
Emp. Form.:
C28H41N5O5S
Mol. Mass.:
559.721
SMILES:
CC(C)n1c2ccccc2cc(C(=O)N[C@@H]2C[C@@H]3CC[C@H](C2)N3C[C@H](O)CN2CCN(CC2)S(C)(=O)=O)c1=O
: