Target
Urotensin-2
Ligand
BDBM50414768
Substrate
Meas. Tech.
ChEMBL_588520 (CHEMBL1041260)
EC50
3467.37±n/a nM
Citation
 Lehmann, FCurrier, EAClemons, BHansen, LKOlsson, RHacksell, ULuthman, K Novel and potent small-molecule urotensin II receptor agonists. Bioorg Med Chem 17:4657-65 (2009)  
Target
Name:
Urotensin-2
Synonyms:
UTS2 | UTS2_HUMAN
Type:
PROTEIN
Mol. Mass.:
14297.49
Organism:
Homo sapiens (Human)
Description:
ChEMBL_643307
Residue:
124
  
Inhibitor
Name:
BDBM50414768
Synonyms:
CHEMBL572423
Type:
Small organic molecule
Emp. Form.:
C32H30N2O
Mol. Mass.:
458.5934
SMILES:
CN(C)CCC(NC(=O)c1cccc(c1)-c1ccc2ccccc2c1)c1ccc2ccccc2c1
: