Target
Urotensin-2
Ligand
BDBM50414780
Substrate
Meas. Tech.
ChEMBL_588520 (CHEMBL1041260)
EC50
74.13±n/a nM
Citation
 Lehmann, FCurrier, EAClemons, BHansen, LKOlsson, RHacksell, ULuthman, K Novel and potent small-molecule urotensin II receptor agonists. Bioorg Med Chem 17:4657-65 (2009)  
Target
Name:
Urotensin-2
Synonyms:
UTS2 | UTS2_HUMAN
Type:
PROTEIN
Mol. Mass.:
14297.49
Organism:
Homo sapiens (Human)
Description:
ChEMBL_643307
Residue:
124
  
Inhibitor
Name:
BDBM50414780
Synonyms:
CHEMBL573569
Type:
Small organic molecule
Emp. Form.:
C25H27ClN2O2
Mol. Mass.:
422.947
SMILES:
COc1ccc(cc1)-c1ccc(cc1)C(=O)NC(CCN(C)C)c1ccc(Cl)cc1
: