Target
Urotensin-2
Ligand
BDBM50414783
Substrate
Meas. Tech.
ChEMBL_588520 (CHEMBL1041260)
EC50
363.08±n/a nM
Citation
 Lehmann, FCurrier, EAClemons, BHansen, LKOlsson, RHacksell, ULuthman, K Novel and potent small-molecule urotensin II receptor agonists. Bioorg Med Chem 17:4657-65 (2009)  
Target
Name:
Urotensin-2
Synonyms:
UTS2 | UTS2_HUMAN
Type:
PROTEIN
Mol. Mass.:
14297.49
Organism:
Homo sapiens (Human)
Description:
ChEMBL_643307
Residue:
124
  
Inhibitor
Name:
BDBM50414783
Synonyms:
CHEMBL573575
Type:
Small organic molecule
Emp. Form.:
C28H27ClN2O
Mol. Mass.:
442.98
SMILES:
CN(C)CCC(NC(=O)c1cccc(c1)-c1ccc2ccccc2c1)c1ccc(Cl)cc1
: