Target
Histamine H3 receptor
Ligand
BDBM50414805
Substrate
Meas. Tech.
ChEMBL_587793 (CHEMBL1042247)
Ki
1.1±n/a nM
Citation
 Dvorak, CAApodaca, RXiao, WJablonowski, JABonaventure, PDugovic, CShelton, JLord, BMiller, KDvorak, LKLovenberg, TWCarruthers, NI Diamine-based human histamine H3 receptor antagonists: (4-aminobutyn-1-yl)benzylamines. Eur J Med Chem 44:4098-106 (2009)  
Target
Name:
Histamine H3 receptor
Synonyms:
G-protein coupled receptor 97 HH3R HRH3 Histamine H3 receptor (H3) Histamine receptor (H3 and H4)
Type:
G Protein-Coupled Receptor (GPCR)
Mol. Mass.:
48691.47
Organism:
Homo sapiens (Human)
Description:
Binding assays were using CHO cells stably expressing hH3R receptors.
Residue:
445
  
Inhibitor
Name:
BDBM50414805
Synonyms:
CHEMBL574711
Type:
Small organic molecule
Emp. Form.:
C20H30N2
Mol. Mass.:
298.4656
SMILES:
CCN(CC)Cc1ccc(cc1)C#CCCN1CCCCC1
: