Target
Neuropeptide FF receptor 2
Ligand
BDBM50394978
Substrate
Meas. Tech.
ChEMBL_590509 (CHEMBL1058556)
EC50
1258.93±n/a nM
Citation
 Gaubert, GBertozzi, FKelly, NMPawlas, JScully, ALNash, NRGardell, LRLameh, JOlsson, R Discovery of selective nonpeptidergic neuropeptide FF2 receptor agonists. J Med Chem 52:6511-4 (2009)  
Target
Name:
Neuropeptide FF receptor 2
Synonyms:
G-protein coupled receptor 74 GPR74 NPFF2_HUMAN NPGPR Neuropeptide G-protein coupled receptor
Type:
Enzyme Catalytic Domain
Mol. Mass.:
60293.78
Organism:
Homo sapiens (Human)
Description:
NPFF2 0 HUMAN::Q9Y5X5
Residue:
522
  
Inhibitor
Name:
BDBM50394978
Synonyms:
CHEMBL573297
Type:
Small organic molecule
Emp. Form.:
C8H8Br2N4
Mol. Mass.:
319.984
SMILES:
[#7]\[#6](-[#7])=[#7]\[#7]=[#6]-c1ccc(Br)c(Br)c1
: