Target
Monoglyceride lipase
Ligand
BDBM50414943
Substrate
Meas. Tech.
ChEMBL_592875 (CHEMBL1046620)
IC50
316.23±n/a nM
Citation
 Kapanda, CNMuccioli, GGLabar, GPoupaert, JHLambert, DM Bis(dialkylaminethiocarbonyl)disulfides as potent and selective monoglyceride lipase inhibitors. J Med Chem 52:7310-4 (2009)  
Target
Name:
Monoglyceride lipase
Synonyms:
HU-K5 Lysophospholipase-like MGL MGLL_HUMAN
Type:
Hydrolase
Mol. Mass.:
33264.56
Organism:
Homo sapiens (Human)
Description:
Human recombinant MGL (Cayman Chemical, cat# 10008354).
Residue:
303
  
Inhibitor
Name:
BDBM50414943
Synonyms:
CHEMBL573920
Type:
Small organic molecule
Emp. Form.:
C10H16N2S6
Mol. Mass.:
356.637
SMILES:
S=C(SSC(=S)N1CCSCC1)N1CCSCC1
: