Target
Monoglyceride lipase
Ligand
BDBM50414946
Substrate
Meas. Tech.
ChEMBL_592875 (CHEMBL1046620)
IC50
478.63±n/a nM
Citation
 Kapanda, CNMuccioli, GGLabar, GPoupaert, JHLambert, DM Bis(dialkylaminethiocarbonyl)disulfides as potent and selective monoglyceride lipase inhibitors. J Med Chem 52:7310-4 (2009)  
Target
Name:
Monoglyceride lipase
Synonyms:
HU-K5 Lysophospholipase-like MGL MGLL_HUMAN
Type:
Hydrolase
Mol. Mass.:
33264.56
Organism:
Homo sapiens (Human)
Description:
Human recombinant MGL (Cayman Chemical, cat# 10008354).
Residue:
303
  
Inhibitor
Name:
BDBM50414946
Synonyms:
CHEMBL571273
Type:
Small organic molecule
Emp. Form.:
C16H28N2S4
Mol. Mass.:
376.667
SMILES:
CC1CCCC(C)N1C(=S)SSC(=S)N1C(C)CCCC1C
: