Target
cAMP-specific 3',5'-cyclic phosphodiesterase 4B
Ligand
BDBM50415007
Substrate
Meas. Tech.
ChEMBL_599733 (CHEMBL1048177)
IC50
0.631±n/a nM
Citation
 Woodrow, MDBallantine, SPBarker, MDClarke, BJDawson, JDean, TWDelves, CJEvans, BGough, SLGuntrip, SBHolman, SHolmes, DSKranz, MLindvaal, MKLucas, FSNeu, MRanshaw, LESolanke, YESomers, DOWard, PWiseman, JO Quinolines as a novel structural class of potent and selective PDE4 inhibitors. Optimisation for inhaled administration. Bioorg Med Chem Lett 19:5261-5 (2009)  
Target
Name:
cAMP-specific 3',5'-cyclic phosphodiesterase 4B
Synonyms:
3',5'-cyclic phosphodiesterase Isoform PDE4B1 PDE4B PDE4B_HUMAN Phosphodiesterase 4B (PDE4B) Phosphodiesterase Type 4 (PDE4B)
Type:
Protein
Mol. Mass.:
83318.87
Organism:
Homo sapiens (Human)
Description:
Q07343
Residue:
736
  
Inhibitor
Name:
BDBM50415007
Synonyms:
CHEMBL571171
Type:
Small organic molecule
Emp. Form.:
C27H27N3O4S
Mol. Mass.:
489.586
SMILES:
COc1cccc(Nc2c(cnc3ccc(cc23)S(=O)(=O)c2ccc(cc2)C(C)(C)C)C(N)=O)c1
: