Target
Cyclin-dependent kinase 5 activator 1
Ligand
BDBM50415039
Substrate
Meas. Tech.
ChEMBL_598630 (CHEMBL1048133)
IC50
8±n/a nM
Citation
 Helal, CJKang, ZLucas, JCGant, TAhlijanian, MKSchachter, JBRichter, KECook, JMMenniti, FSKelly, KMente, SPandit, JHosea, N Potent and cellularly active 4-aminoimidazole inhibitors of cyclin-dependent kinase 5/p25 for the treatment of Alzheimer's disease. Bioorg Med Chem Lett 19:5703-7 (2009)  
Target
Name:
Cyclin-dependent kinase 5 activator 1
Synonyms:
CDK5/p35 Cyclin-dependent kinase 5 regulatory subunit 1 | Cyclin-dependent kinase 5/CDK5 activator 1
Type:
Protein Complex
Mol. Mass.:
Description:
Components:
This complex has 2 components.
Component 1
Name:
Cyclin-dependent kinase 5
Synonyms:
CDK5 CDKN5 Cyclin-dependent kinase 5 (CDK5/ p25) Cyclin-dependent-like kinase 5 PSSALRE Tau protein kinase II catalytic subunit
Type:
Enzyme Subunit
Mol. Mass.:
33308.61
Organism:
Homo sapiens (Human)
Description:
Residue:
292
  
Component 2
Name:
Cyclin-dependent kinase 5 activator 1
Synonyms:
CD5R1_HUMAN CDK5R1 Cyclin-dependent kinase 5 (CDK5/p25) NCK5A p35
Type:
Enzyme Subunit
Mol. Mass.:
34077.43
Organism:
Homo sapiens (Human)
Description:
Q15078
Residue:
307
  
Inhibitor
Name:
BDBM50415039
Synonyms:
CHEMBL571780
Type:
Small organic molecule
Emp. Form.:
C21H22N4O2
Mol. Mass.:
362.425
SMILES:
CC(=O)N[C@H]1C[C@H](C1)n1cnc(NC(=O)Cc2cccc3ccccc23)c1
: