Target
Cholecystokinin receptor type A
Ligand
BDBM50415076
Substrate
Meas. Tech.
ChEMBL_595453 (CHEMBL1045218)
Ki
200±n/a nM
Citation
 Pippel, MBoyce, KVenkatesan, HPhuong, VKYan, WBarrett, TDLagaud, GLi, LMorton, MFPrendergast, CWu, XShankley, NPRabinowitz, MH Anthranilic sulfonamide CCK1/CCK2 dual receptor antagonists II: tuning of receptor selectivity and in vivo efficacy. Bioorg Med Chem Lett 19:6376-8 (2009)  
Target
Name:
Cholecystokinin receptor type A
Synonyms:
CCK-A receptor CCK1-R CCKAR_HUMAN Cholecystokinin receptor Cholecystokinin-1 Receptor
Type:
G Protein-Coupled Receptor (GPCR)
Mol. Mass.:
47859.34
Organism:
Homo sapiens (Human)
Description:
Stable expression of human CCK-1 receptors in HEK 293 cells.
Residue:
428
  
Inhibitor
Name:
BDBM50415076
Synonyms:
CHEMBL583344
Type:
Small organic molecule
Emp. Form.:
C22H15Cl2IN4O5S2
Mol. Mass.:
677.319
SMILES:
OC(=O)[C@H](Cc1ccc(Cl)c(Cl)c1)NC(=O)c1ccc(I)cc1NS(=O)(=O)c1cccc2nsnc12
: