Target
Muscarinic acetylcholine receptor M1
Ligand
BDBM50415145
Substrate
Meas. Tech.
ChEMBL_596255 (CHEMBL1048031)
Ki
1.23±n/a nM
Citation
 Scapecchi, SNesi, MMatucci, RBellucci, CBuccioni, MDei, SGuandalini, LManetti, DMartelli, CMartini, EMarucci, GOrlandi, FRomanelli, MNTeodori, ECirilli, R Synthesis, affinity profile and functional activity of potent chiral muscarinic antagonists with a pyrrolidinylfuran structure. J Med Chem 53:201-7 (2010)  
Target
Name:
Muscarinic acetylcholine receptor M1
Synonyms:
ACM1_HUMAN Cholinergic receptor, muscarinic 1 | Cholinergic, muscarinic M1
Type:
Protein
Mol. Mass.:
51442.54
Organism:
Homo sapiens (Human)
Description:
P11229
Residue:
460
  
Inhibitor
Name:
BDBM50415145
Synonyms:
CHEMBL571121
Type:
Small organic molecule
Emp. Form.:
C22H29NO2
Mol. Mass.:
339.4712
SMILES:
CN1CCC[C@@H]1c1ccc(o1)[C@@](O)(C1CCCCC1)c1ccccc1
: