Target
Muscarinic acetylcholine receptor M1
Ligand
BDBM50415149
Substrate
Meas. Tech.
ChEMBL_596255 (CHEMBL1048031)
Ki
42.66±n/a nM
Citation
 Scapecchi, SNesi, MMatucci, RBellucci, CBuccioni, MDei, SGuandalini, LManetti, DMartelli, CMartini, EMarucci, GOrlandi, FRomanelli, MNTeodori, ECirilli, R Synthesis, affinity profile and functional activity of potent chiral muscarinic antagonists with a pyrrolidinylfuran structure. J Med Chem 53:201-7 (2010)  
Target
Name:
Muscarinic acetylcholine receptor M1
Synonyms:
ACM1_HUMAN Cholinergic receptor, muscarinic 1 | Cholinergic, muscarinic M1
Type:
Protein
Mol. Mass.:
51442.54
Organism:
Homo sapiens (Human)
Description:
P11229
Residue:
460
  
Inhibitor
Name:
BDBM50415149
Synonyms:
CHEMBL571123
Type:
Small organic molecule
Emp. Form.:
C22H23NO
Mol. Mass.:
317.4241
SMILES:
CN1CCCC1c1ccc(o1)C(c1ccccc1)c1ccccc1
: