Target
Muscarinic acetylcholine receptor M1
Ligand
BDBM50415155
Substrate
Meas. Tech.
ChEMBL_596255 (CHEMBL1048031)
Ki
47.86±n/a nM
Citation
 Scapecchi, SNesi, MMatucci, RBellucci, CBuccioni, MDei, SGuandalini, LManetti, DMartelli, CMartini, EMarucci, GOrlandi, FRomanelli, MNTeodori, ECirilli, R Synthesis, affinity profile and functional activity of potent chiral muscarinic antagonists with a pyrrolidinylfuran structure. J Med Chem 53:201-7 (2010)  
Target
Name:
Muscarinic acetylcholine receptor M1
Synonyms:
ACM1_HUMAN Cholinergic receptor, muscarinic 1 | Cholinergic, muscarinic M1
Type:
Protein
Mol. Mass.:
51442.54
Organism:
Homo sapiens (Human)
Description:
P11229
Residue:
460
  
Inhibitor
Name:
BDBM50415155
Synonyms:
CHEMBL568775
Type:
Small organic molecule
Emp. Form.:
C23H32NO2
Mol. Mass.:
354.5051
SMILES:
C[N+]1(C)CCC[C@@H]1c1ccc(o1)[C@](O)(C1CCCCC1)c1ccccc1
: