Target
Muscarinic acetylcholine receptor M1
Ligand
BDBM50415213
Substrate
Meas. Tech.
ChEMBL_605172 (CHEMBL1067394)
Ki
>100000±n/a nM
Citation
 Piergentili, AQuaglia, WDel Bello, FGiannella, MPigini, MBarocelli, EBertoni, SMatucci, RNesi, MBruni, BDi Vaira, M Properly substituted 1,4-dioxane nucleus favours the selective M3 muscarinic receptor activation. Bioorg Med Chem 17:8174-85 (2009)  
Target
Name:
Muscarinic acetylcholine receptor M1
Synonyms:
ACM1_HUMAN Cholinergic receptor, muscarinic 1 | Cholinergic, muscarinic M1
Type:
Protein
Mol. Mass.:
51442.54
Organism:
Homo sapiens (Human)
Description:
P11229
Residue:
460
  
Inhibitor
Name:
BDBM50415213
Synonyms:
CHEMBL608985
Type:
Small organic molecule
Emp. Form.:
C10H22NO2
Mol. Mass.:
188.2866
SMILES:
C[C@H]1OC[C@@H](C[N+](C)(C)C)O[C@H]1C
: