Target
Muscarinic acetylcholine receptor M4
Ligand
BDBM50415213
Substrate
Meas. Tech.
ChEMBL_605175 (CHEMBL1067397)
Ki
>100000±n/a nM
Citation
 Piergentili, AQuaglia, WDel Bello, FGiannella, MPigini, MBarocelli, EBertoni, SMatucci, RNesi, MBruni, BDi Vaira, M Properly substituted 1,4-dioxane nucleus favours the selective M3 muscarinic receptor activation. Bioorg Med Chem 17:8174-85 (2009)  
Target
Name:
Muscarinic acetylcholine receptor M4
Synonyms:
ACM4_HUMAN Cholinergic, muscarinic M4 Muscarinic acetylcholine receptor M2 and M4
Type:
Enzyme Catalytic Domain
Mol. Mass.:
53079.31
Organism:
Homo sapiens (Human)
Description:
Cholinergic, muscarinic M4 CHRM4 HUMAN M3::P08173
Residue:
479
  
Inhibitor
Name:
BDBM50415213
Synonyms:
CHEMBL608985
Type:
Small organic molecule
Emp. Form.:
C10H22NO2
Mol. Mass.:
188.2866
SMILES:
C[C@H]1OC[C@@H](C[N+](C)(C)C)O[C@H]1C
: