Target
Muscarinic acetylcholine receptor M3
Ligand
BDBM50415225
Substrate
Meas. Tech.
ChEMBL_605174 (CHEMBL1067396)
Ki
10471.29±n/a nM
Citation
 Piergentili, AQuaglia, WDel Bello, FGiannella, MPigini, MBarocelli, EBertoni, SMatucci, RNesi, MBruni, BDi Vaira, M Properly substituted 1,4-dioxane nucleus favours the selective M3 muscarinic receptor activation. Bioorg Med Chem 17:8174-85 (2009)  
Target
Name:
Muscarinic acetylcholine receptor M3
Synonyms:
ACM3_HUMAN Cholinergic, muscarinic M3 Muscarinic receptor M3 | RecName: Full=Muscarinic acetylcholine receptor M3
Type:
Enzyme
Mol. Mass.:
66151.03
Organism:
Homo sapiens (Human)
Description:
P20309
Residue:
590
  
Inhibitor
Name:
BDBM50415225
Synonyms:
CHEMBL593620
Type:
Small organic molecule
Emp. Form.:
C11H24NO2
Mol. Mass.:
202.3132
SMILES:
C[C@@H]1OC[C@@H](C[N+](C)(C)C)OC1(C)C
: