Target
Muscarinic acetylcholine receptor M5
Ligand
BDBM50004656
Substrate
Meas. Tech.
ChEMBL_605176 (CHEMBL1067398)
Ki
69183.1±n/a nM
Citation
 Piergentili, AQuaglia, WDel Bello, FGiannella, MPigini, MBarocelli, EBertoni, SMatucci, RNesi, MBruni, BDi Vaira, M Properly substituted 1,4-dioxane nucleus favours the selective M3 muscarinic receptor activation. Bioorg Med Chem 17:8174-85 (2009)  
Target
Name:
Muscarinic acetylcholine receptor M5
Synonyms:
ACM5_HUMAN | CHRM5
Type:
PROTEIN
Mol. Mass.:
60102.35
Organism:
Homo sapiens (Human)
Description:
ChEMBL_1517990
Residue:
532
  
Inhibitor
Name:
BDBM50004656
Synonyms:
(2-Carbamoyloxy-ethyl)-trimethyl-ammonium (2-Hydroxyethyl)trimethyl ammonium chloride carbamate (carbachol)(2-Carbamoyloxy-ethyl)-trimethyl-ammonium 2-((Aminocarbonyl)oxy)-N,N,N-trimethylethanaminum chloride 2-(carbamoyloxy)-N,N,N-trimethylethanaminium chloride CARBASTAT Carbachol chloride Choline carbamate chloride Choline chlorine carbamate Karbamoylcholin chlorid | MIOSTAT
Type:
Small organic molecule
Emp. Form.:
C6H15N2O2
Mol. Mass.:
147.195
SMILES:
C[N+](C)(C)CCOC(N)=O
: