Target
Calcitonin gene-related peptide type 1 receptor
Ligand
BDBM50415363
Substrate
Meas. Tech.
ChEMBL_608969 (CHEMBL1073111)
Ki
5.01±n/a nM
Citation
 Nichols, PLBrand, JBriggs, MD'Angeli, MFarge, JGarland, SLGoldsmith, PHutchings, RKilford, ILi, HYMacPherson, DNimmo, FSanderson, FDSehmi, SShuker, NSkidmore, JStott, MSweeting, JTajuddin, HTakle, AKTrani, GWall, IDWard, RWilson, DMWitty, D Potent oxadiazole CGRP receptor antagonists for the potential treatment of migraine. Bioorg Med Chem Lett 20:1368-72 (2010)  
Target
Name:
Calcitonin gene-related peptide type 1 receptor
Synonyms:
Adrenomedullin receptor AM1; CALCRL/RAMP2 CALRL_HUMAN CGRP type 1 receptor mRNA Calcitonin gene-related peptide (CGRP) receptor Calcitonin receptor-like receptor Human CL receptor
Type:
Enzyme Catalytic Domain
Mol. Mass.:
52980.45
Organism:
Homo sapiens (Human)
Description:
Q16602
Residue:
461
  
Inhibitor
Name:
BDBM50415363
Synonyms:
CHEMBL605579
Type:
Small organic molecule
Emp. Form.:
C25H28ClN7O4
Mol. Mass.:
525.987
SMILES:
CN(C)CCOc1cc(Cl)cc(c1)-c1nnc(CC(=O)N2CCC(CC2)n2c3cccnc3[nH]c2=O)o1
: