Target
Histamine H4 receptor
Ligand
BDBM50415489
Substrate
Meas. Tech.
ChEMBL_613516 (CHEMBL1074193)
Ki
100±n/a nM
Citation
 Smits, RAAdami, MIstyastono, EPZuiderveld, OPvan Dam, CMde Kanter, FJJongejan, ACoruzzi, GLeurs, Rde Esch, IJ Synthesis and QSAR of quinazoline sulfonamides as highly potent human histamine H4 receptor inverse agonists. J Med Chem 53:2390-400 (2010)  
Target
Name:
Histamine H4 receptor
Synonyms:
HH4R Hrh4
Type:
G Protein-Coupled Receptor (GPCR)
Mol. Mass.:
44045.07
Organism:
Rattus norvegicus (rat)
Description:
Cell pellets from SK-N-MC cells transfected with rat H4 receptor were used in binding assay.
Residue:
391
  
Inhibitor
Name:
BDBM50415489
Synonyms:
CHEMBL591969
Type:
Small organic molecule
Emp. Form.:
C15H21ClN6O2S
Mol. Mass.:
384.884
SMILES:
CN1CCN(CC1)c1nc(NCCS(N)(=O)=O)c2cc(Cl)ccc2n1
: