Target
Macrophage colony-stimulating factor 1 receptor
Ligand
BDBM50415616
Substrate
Meas. Tech.
ChEMBL_621752 (CHEMBL1108484)
IC50
>10000±n/a nM
Citation
 Christopher, JAAtkinson, FLBax, BDBrown, MJChampigny, ACChuang, TTJones, EJMosley, JEMusgrave, JR 1-Aryl-3,4-dihydroisoquinoline inhibitors of JNK3. Bioorg Med Chem Lett 19:2230-4 (2009)  
Target
Name:
Macrophage colony-stimulating factor 1 receptor
Synonyms:
CSF1R FMS Macrophage colony stimulating factor receptor Macrophage colony-stimulating factor 1 receptor (c-FMS) Proto-oncogene c-Fms c-fms | cFMS
Type:
Protein
Mol. Mass.:
107979.48
Organism:
Homo sapiens (Human)
Description:
P07333
Residue:
972
  
Inhibitor
Name:
BDBM50415616
Synonyms:
CHEMBL1087421
Type:
Small organic molecule
Emp. Form.:
C16H12Cl3NO
Mol. Mass.:
340.632
SMILES:
COc1cc2CCN=C(c3ccc(Cl)c(Cl)c3)c2cc1Cl
: