Target
Mitogen-activated protein kinase 14
Ligand
BDBM50415614
Substrate
Meas. Tech.
ChEMBL_621743 (CHEMBL1108475)
IC50
>15848.93±n/a nM
Citation
 Christopher, JAAtkinson, FLBax, BDBrown, MJChampigny, ACChuang, TTJones, EJMosley, JEMusgrave, JR 1-Aryl-3,4-dihydroisoquinoline inhibitors of JNK3. Bioorg Med Chem Lett 19:2230-4 (2009)  
Target
Name:
Mitogen-activated protein kinase 14
Synonyms:
CSAID-binding protein CSBP1 CSPB1 MAP kinase 14 MAP kinase p38 alpha MAPK14 MK14_HUMAN Mitogen-activated protein kinase p38 alpha Stress-activated protein kinase 2a | p38 MAP kinase alpha/beta
Type:
Serine/threonine-protein kinase
Mol. Mass.:
41286.76
Organism:
Homo sapiens (Human)
Description:
Q16539
Residue:
360
  
Inhibitor
Name:
BDBM50415614
Synonyms:
CHEMBL1088053
Type:
Small organic molecule
Emp. Form.:
C20H16ClNO
Mol. Mass.:
321.8
SMILES:
COc1cc2CCN=C(c3ccc4ccccc4c3)c2cc1Cl
: