Target
Serine/threonine-protein kinase PLK1
Ligand
BDBM50415620
Substrate
Meas. Tech.
ChEMBL_621761 (CHEMBL1108493)
IC50
>10000±n/a nM
Citation
 Christopher, JAAtkinson, FLBax, BDBrown, MJChampigny, ACChuang, TTJones, EJMosley, JEMusgrave, JR 1-Aryl-3,4-dihydroisoquinoline inhibitors of JNK3. Bioorg Med Chem Lett 19:2230-4 (2009)  
Target
Name:
Serine/threonine-protein kinase PLK1
Synonyms:
PLK PLK1 Polo-like kinase 1 (PlK1) STPK13 Serine/threonine-protein kinase 13 | polo-like kinase
Type:
Serine/threonine-protein kinase
Mol. Mass.:
68277.16
Organism:
Homo sapiens (Human)
Description:
P53350
Residue:
603
  
Inhibitor
Name:
BDBM50415620
Synonyms:
CHEMBL1088633
Type:
Small organic molecule
Emp. Form.:
C16H13Cl2NO
Mol. Mass.:
306.187
SMILES:
COc1cc2CCN=C(c3cccc(Cl)c3)c2cc1Cl
: